Target
Serine/threonine-protein kinase Chk1 [2-280]
Ligand
BDBM91931
Substrate
Meas. Tech.
33P-Radiometric_Method1
Ki
949±n/a nM
Citation
 D3R, DD Abbott CHK1 Kinase D3R 221:0 (2015) Target
Name:
Serine/threonine-protein kinase Chk1 [2-280]
Synonyms:
CHEK1 CHK1_HUMAN | CHK1_Kinase
Type:
Mol. Mass.:
32109.16
Organism:
Homo sapiens (Human)
Description:
O14757[2-280]
Residue:
279
  
Inhibitor
Name:
BDBM91931
Synonyms:
Chk1_63
Type:
Emp. Form.:
C26H25N3O2S2
Mol. Mass.:
475.626
SMILES:
OC1CCC(CC1)NCc1ccc-2c(Cc3c-2n[nH]c3-c2ccc(s2)-c2ccc(C=O)s2)c1
: