Target
Serine/threonine-protein kinase Chk1 [2-280]
Ligand
BDBM91960
Substrate
Meas. Tech.
33P-Radiometric_Method1
Ki
>10000±n/a nM
Citation
 D3R, DD Abbott CHK1 Kinase D3R 221:0 (2015) Target
Name:
Serine/threonine-protein kinase Chk1 [2-280]
Synonyms:
CHEK1 CHK1_HUMAN | CHK1_Kinase
Type:
Mol. Mass.:
32109.16
Organism:
Homo sapiens (Human)
Description:
O14757[2-280]
Residue:
279
  
Inhibitor
Name:
BDBM91960
Synonyms:
Chk1_91
Type:
Emp. Form.:
C14H9N7O
Mol. Mass.:
291.2676
SMILES:
O=C(Nc1cnc(cn1)C#N)Nc1cnc2ccccc2n1
: