Target
Serine/threonine-protein kinase Chk1 [2-280]
Ligand
BDBM91965
Substrate
Meas. Tech.
33P-Radiometric_Method1
Ki
3590±n/a nM
Citation
 D3R, DD Abbott CHK1 Kinase D3R 221:0 (2015) Target
Name:
Serine/threonine-protein kinase Chk1 [2-280]
Synonyms:
CHEK1 CHK1_HUMAN | CHK1_Kinase
Type:
Mol. Mass.:
32109.16
Organism:
Homo sapiens (Human)
Description:
O14757[2-280]
Residue:
279
  
Inhibitor
Name:
BDBM91965
Synonyms:
Chk1_96
Type:
Emp. Form.:
C26H25N3O4
Mol. Mass.:
443.4944
SMILES:
COc1cc(ccc1C(=O)N1CCCC1CO)-c1ccc2c(Nc3ccccc3NC2=O)c1
: