Target
Serine/threonine-protein kinase Chk1 [2-280]
Ligand
BDBM91838
Substrate
Meas. Tech.
33P-Radiometric_Method1
Ki
7.17±n/a nM
Citation
 D3R, DD Abbott CHK1 Kinase D3R 221:0 (2015) Target
Name:
Serine/threonine-protein kinase Chk1 [2-280]
Synonyms:
CHEK1 CHK1_HUMAN | CHK1_Kinase
Type:
Mol. Mass.:
32109.16
Organism:
Homo sapiens (Human)
Description:
O14757[2-280]
Residue:
279
  
Inhibitor
Name:
BDBM91838
Synonyms:
Chk1_111
Type:
Emp. Form.:
C29H24N4O7S
Mol. Mass.:
572.588
SMILES:
COc1cc(ccc1[N+]([O-])=O)-c1ccc2c(Nc3ccc(NC(=O)CCS(=O)(=O)c4ccccc4)cc3NC2=O)c1
: