Target
Serine/threonine-protein kinase Chk1 [2-280]
Ligand
BDBM225365
Substrate
Meas. Tech.
33P-Radiometric_Method1
Ki
23.9±n/a nM
Citation
 D3R, DD Abbott CHK1 Kinase D3R 221:0 (2015) Target
Name:
Serine/threonine-protein kinase Chk1 [2-280]
Synonyms:
CHEK1 CHK1_HUMAN | CHK1_Kinase
Type:
Mol. Mass.:
32109.16
Organism:
Homo sapiens (Human)
Description:
O14757[2-280]
Residue:
279
  
Inhibitor
Name:
BDBM225365
Synonyms:
Chk1_114
Type:
Small Organic Molecule
Emp. Form.:
C19H15N3O3
Mol. Mass.:
333.3407
SMILES:
CNC(=O)c1ccc2Cc3c(n[nH]c3-c3ccc(cc3)C(O)=O)-c2c1
: