Target
Serine/threonine-protein kinase Chk1 [2-280]
Ligand
BDBM91844
Substrate
Meas. Tech.
33P-Radiometric_Method1
Ki
24.5±n/a nM
Citation
 D3R, DD Abbott CHK1 Kinase D3R 221:0 (2015) Target
Name:
Serine/threonine-protein kinase Chk1 [2-280]
Synonyms:
CHEK1 CHK1_HUMAN | CHK1_Kinase
Type:
Mol. Mass.:
32109.16
Organism:
Homo sapiens (Human)
Description:
O14757[2-280]
Residue:
279
  
Inhibitor
Name:
BDBM91844
Synonyms:
Chk1_119
Type:
Emp. Form.:
C26H26N4O6
Mol. Mass.:
490.5078
SMILES:
COc1cc(ccc1[N+]([O-])=O)-c1ccc2c(Nc3ccc(OCCN4CCOCC4)cc3NC2=O)c1
: