Target
Serine/threonine-protein kinase Chk1 [2-280]
Ligand
BDBM91856
Substrate
Meas. Tech.
33P-Radiometric_Method1
Ki
777±n/a nM
Citation
 D3R, DD Abbott CHK1 Kinase D3R 221:0 (2015) Target
Name:
Serine/threonine-protein kinase Chk1 [2-280]
Synonyms:
CHEK1 CHK1_HUMAN | CHK1_Kinase
Type:
Mol. Mass.:
32109.16
Organism:
Homo sapiens (Human)
Description:
O14757[2-280]
Residue:
279
  
Inhibitor
Name:
BDBM91856
Synonyms:
Chk1_132
Type:
Emp. Form.:
C31H26ClFN4O3
Mol. Mass.:
557.015
SMILES:
Fc1cc(ccc1Cl)-c1ccc2c(Nc3ccc(CC(=O)Nc4ccc(cc4)N4CCOCC4)cc3NC2=O)c1
: