Target
Serine/threonine-protein kinase Chk1 [2-280]
Ligand
BDBM225376
Substrate
Meas. Tech.
33P-Radiometric_Method1
Ki
0.81±n/a nM
Citation
 D3R, DD Abbott CHK1 Kinase D3R 221:0 (2015) Target
Name:
Serine/threonine-protein kinase Chk1 [2-280]
Synonyms:
CHEK1 CHK1_HUMAN | CHK1_Kinase
Type:
Mol. Mass.:
32109.16
Organism:
Homo sapiens (Human)
Description:
O14757[2-280]
Residue:
279
  
Inhibitor
Name:
BDBM225376
Synonyms:
Chk1_145
Type:
Small Organic Molecule
Emp. Form.:
C18H14N4O2
Mol. Mass.:
318.3294
SMILES:
COc1cc2Cc3c(n[nH]c3-c3ccc(nc3)C#N)-c2cc1OC
: