Target
Mitogen-activated protein kinase 1
Ligand
BDBM92240
Substrate
Meas. Tech.
Photometric_Method2
Ki
2±n/a nM
Citation
 D3R, DD Vertex ERK2 D3R 222:0 (2015) Target
Name:
Mitogen-activated protein kinase 1
Synonyms:
ERK2 Extracellular signal-regulated kinase 2 Extracellular signal-regulated kinase 2 (ERK2) MAPK 2 MK01_HUMAN Mitogen-activated protein kinase 1 (ERK-2) Mitogen-activated protein kinase 2 PRKM2 | p42-MAPK
Type:
Ser/Thr Protein Kinase
Mol. Mass.:
41392.76
Organism:
Homo sapiens (Human)
Description:
P28482
Residue:
360
  
Inhibitor
Name:
BDBM92240
Synonyms:
erk000709
Type:
Emp. Form.:
C23H28ClN5O3
Mol. Mass.:
457.953
SMILES:
CC[C@@H](CO)Nc1ncc(C)c(n1)-c1c[nH]c(c1)C(=O)N(C)[C@H](CO)c1cccc(Cl)c1
: