Target
Malate synthase G [C619A]
Ligand
BDBM225391
Substrate
Meas. Tech.
DNTB-Coupled_Enzyme_Assay
IC50
2700±n/a nM
Citation
 D3R, DD Sacchettini GlcB D3R 223:0 (2015) Target
Name:
Malate synthase G [C619A]
Synonyms:
MASZ_MYCTO | glcB
Type:
Mol. Mass.:
80350.85
Organism:
Mycobacterium tuberculosis (strain CDC 1551 / Oshkosh)
Description:
P9WK16[C619A]
Residue:
741
  
Inhibitor
Name:
BDBM225391
Synonyms:
Sacchettini_10
Type:
Small Organic Molecule
Emp. Form.:
C10H6ClFO4
Mol. Mass.:
244.604
SMILES:
OC(=O)C(=O)CC(=O)c1c(F)cccc1Cl
: