Target
UDP-3-O-acyl-N-acetylglucosamine deacetylase
Ligand
BDBM92263
Substrate
Meas. Tech.
Thermofluor_Method1
Kd
>100000±n/a nM
Citation
 D3R, DD CSAR LpxC D3R 224:0 (2015) Target
Name:
UDP-3-O-acyl-N-acetylglucosamine deacetylase
Synonyms:
LPXC_PSEAE UDP-3-O-[3-hydroxymyristoyl] N-acetylglucosamine deacetylase UDP-3-O-[3-hydroxymyristoyl] N-acetylglucosamine deacetylase (LpxC) UDP-3-O-acyl-GlcNAc deacetylase (LpxC) lpxC
Type:
Enzyme
Mol. Mass.:
33428.15
Organism:
Pseudomonas aeruginosa
Description:
P47205
Residue:
303
  
Inhibitor
Name:
BDBM92263
Synonyms:
CS253
Type:
Emp. Form.:
C22H24N4O5
Mol. Mass.:
424.4498
SMILES:
C[C@@H](O)[C@H](NC(=O)c1ccc(cc1)-c1ccccc1)C(=O)NCC1(C)NC(=O)NC1=O
: