Target
UDP-3-O-acyl-N-acetylglucosamine deacetylase
Ligand
BDBM92275
Substrate
Meas. Tech.
Thermofluor_Method1
Kd
7250±439 nM
Citation
 D3R, DD CSAR LpxC D3R 224:0 (2015) Target
Name:
UDP-3-O-acyl-N-acetylglucosamine deacetylase
Synonyms:
LPXC_PSEAE UDP-3-O-[3-hydroxymyristoyl] N-acetylglucosamine deacetylase UDP-3-O-[3-hydroxymyristoyl] N-acetylglucosamine deacetylase (LpxC) UDP-3-O-acyl-GlcNAc deacetylase (LpxC) lpxC
Type:
Enzyme
Mol. Mass.:
33428.15
Organism:
Pseudomonas aeruginosa
Description:
P47205
Residue:
303
  
Inhibitor
Name:
BDBM92275
Synonyms:
CS268
Type:
Emp. Form.:
C10H9N3O5
Mol. Mass.:
251.1956
SMILES:
ONC(=O)[C@H]1COC(=N1)c1ccc(cc1)[N+]([O-])=O
: