Target
UDP-3-O-acyl-N-acetylglucosamine deacetylase
Ligand
BDBM92279
Substrate
Meas. Tech.
Thermofluor_Method1
Kd
1500±120 nM
Citation
 D3R, DD CSAR LpxC D3R 224:0 (2015) Target
Name:
UDP-3-O-acyl-N-acetylglucosamine deacetylase
Synonyms:
LPXC_PSEAE UDP-3-O-[3-hydroxymyristoyl] N-acetylglucosamine deacetylase UDP-3-O-[3-hydroxymyristoyl] N-acetylglucosamine deacetylase (LpxC) UDP-3-O-acyl-GlcNAc deacetylase (LpxC) lpxC
Type:
Enzyme
Mol. Mass.:
33428.15
Organism:
Pseudomonas aeruginosa
Description:
P47205
Residue:
303
  
Inhibitor
Name:
BDBM92279
Synonyms:
CS272
Type:
Emp. Form.:
C12H10FN3O3
Mol. Mass.:
263.2245
SMILES:
ONC(=O)[C@H]1COC(=N1)c1cc2cc(F)ccc2[nH]1
: