Target
tRNA (guanine-N(1)-)-methyltransferase
Ligand
BDBM225673
Substrate
Meas. Tech.
ScintillationProximity_Assay
IC50
25119±n/a nM
Citation
 D3R, DD GSK TrmD D3R 226:0 (2015) Target
Name:
tRNA (guanine-N(1)-)-methyltransferase
Synonyms:
TRMD_HAEIN | trmD
Type:
Mol. Mass.:
27538.79
Organism:
Haemophilus influenzae (strain ATCC 51907 / DSM 11121 / KW20 / Rd)
Description:
Residue:
246
  
Inhibitor
Name:
BDBM225673
Synonyms:
GTC000445A
Type:
Small Organic Molecule
Emp. Form.:
C6H7N3O
Mol. Mass.:
137.1393
SMILES:
NC(=O)c1ccc(N)nc1
: