Target
tRNA (guanine-N(1)-)-methyltransferase
Ligand
BDBM225675
Substrate
Meas. Tech.
ScintillationProximity_Assay
IC50
39811±n/a nM
Citation
 D3R, DD GSK TrmD D3R 226:0 (2015) Target
Name:
tRNA (guanine-N(1)-)-methyltransferase
Synonyms:
TRMD_HAEIN | trmD
Type:
Mol. Mass.:
27538.79
Organism:
Haemophilus influenzae (strain ATCC 51907 / DSM 11121 / KW20 / Rd)
Description:
Residue:
246
  
Inhibitor
Name:
BDBM225675
Synonyms:
GTC000448A
Type:
Small Organic Molecule
Emp. Form.:
C10H9ClN4O2
Mol. Mass.:
252.657
SMILES:
Nc1nonc1C(=O)NCc1ccc(Cl)cc1
: