Target
tRNA (guanine-N(1)-)-methyltransferase
Ligand
BDBM225690
Substrate
Meas. Tech.
ScintillationProximity_Assay
IC50
15849±n/a nM
Citation
 D3R, DD GSK TrmD D3R 226:0 (2015) Target
Name:
tRNA (guanine-N(1)-)-methyltransferase
Synonyms:
TRMD_HAEIN | trmD
Type:
Mol. Mass.:
27538.79
Organism:
Haemophilus influenzae (strain ATCC 51907 / DSM 11121 / KW20 / Rd)
Description:
Residue:
246
  
Inhibitor
Name:
BDBM225690
Synonyms:
GTC000463A
Type:
Small Organic Molecule
Emp. Form.:
C13H16N6O2
Mol. Mass.:
288.3051
SMILES:
Nc1nonc1C(=O)N1CCN(Cc2ccccn2)CC1
: