Target
tRNA (guanine-N(1)-)-methyltransferase
Ligand
BDBM225699
Substrate
Meas. Tech.
ScintillationProximity_Assay
IC50
100000±n/a nM
Citation
 D3R, DD GSK TrmD D3R 226:0 (2015) Target
Name:
tRNA (guanine-N(1)-)-methyltransferase
Synonyms:
TRMD_HAEIN | trmD
Type:
Mol. Mass.:
27538.79
Organism:
Haemophilus influenzae (strain ATCC 51907 / DSM 11121 / KW20 / Rd)
Description:
Residue:
246
  
Inhibitor
Name:
BDBM225699
Synonyms:
GTC000472A
Type:
Small Organic Molecule
Emp. Form.:
C8H13N5O2
Mol. Mass.:
211.2211
SMILES:
CN1CCN(CC1)C(=O)c1nonc1N
: