Target
tRNA (guanine-N(1)-)-methyltransferase
Ligand
BDBM225700
Substrate
Meas. Tech.
ScintillationProximity_Assay
IC50
2512±n/a nM
Citation
 D3R, DD GSK TrmD D3R 226:0 (2015) Target
Name:
tRNA (guanine-N(1)-)-methyltransferase
Synonyms:
TRMD_HAEIN | trmD
Type:
Mol. Mass.:
27538.79
Organism:
Haemophilus influenzae (strain ATCC 51907 / DSM 11121 / KW20 / Rd)
Description:
Residue:
246
  
Inhibitor
Name:
BDBM225700
Synonyms:
GTC000473A
Type:
Small Organic Molecule
Emp. Form.:
C10H10N4O2
Mol. Mass.:
218.212
SMILES:
COc1ccc(cc1)C(=O)n1ncnc1N
: