Target
Urokinase-type plasminogen activator [179-424,C299A,N323Q]
Ligand
BDBM92289
Substrate
Meas. Tech.
Photometric_Method1
Ki
610±n/a nM
Citation
 D3R, DD Abbott Urokinase D3R 227:0 (2015) Target
Name:
Urokinase-type plasminogen activator [179-424,C299A,N323Q]
Synonyms:
PLAU Urokinase
Type:
Mol. Mass.:
27687.84
Organism:
Homo sapiens (Human)
Description:
P00749[179-424,C299A,N323Q]
Residue:
246
  
Inhibitor
Name:
BDBM92289
Synonyms:
uPa_12
Type:
Emp. Form.:
C18H16N4O
Mol. Mass.:
304.3458
SMILES:
NC(=N)c1ccc2cc(NC(=O)Nc3ccccc3)ccc2c1
: