Target
Urokinase-type plasminogen activator [179-424,C299A,N323Q]
Ligand
BDBM92296
Substrate
Meas. Tech.
Photometric_Method1
Ki
769±n/a nM
Citation
 D3R, DD Abbott Urokinase D3R 227:0 (2015) Target
Name:
Urokinase-type plasminogen activator [179-424,C299A,N323Q]
Synonyms:
PLAU Urokinase
Type:
Mol. Mass.:
27687.84
Organism:
Homo sapiens (Human)
Description:
P00749[179-424,C299A,N323Q]
Residue:
246
  
Inhibitor
Name:
BDBM92296
Synonyms:
uPa_20
Type:
Emp. Form.:
C22H19N5O3S
Mol. Mass.:
433.483
SMILES:
CS(=O)(=O)n1cc(cn1)-c1cc(cc2ccc(cc12)C(N)=N)C(=O)Nc1ccccc1
: