Target
Urokinase-type plasminogen activator [179-424,C299A,N323Q]
Ligand
BDBM92302
Substrate
Meas. Tech.
Photometric_Method1
Ki
15.7±n/a nM
Citation
 D3R, DD Abbott Urokinase D3R 227:0 (2015) Target
Name:
Urokinase-type plasminogen activator [179-424,C299A,N323Q]
Synonyms:
PLAU Urokinase
Type:
Mol. Mass.:
27687.84
Organism:
Homo sapiens (Human)
Description:
P00749[179-424,C299A,N323Q]
Residue:
246
  
Inhibitor
Name:
BDBM92302
Synonyms:
uPa_26
Type:
Emp. Form.:
C24H23BrN4O
Mol. Mass.:
463.37
SMILES:
CC(C)C1=NCCc2ccc(NC(=O)c3cc(Br)c4cc(ccc4c3)C(N)=N)cc12
: