Target
Urokinase-type plasminogen activator [179-424,C299A,N323Q]
Ligand
BDBM92311
Substrate
Meas. Tech.
Photometric_Method1
Ki
>100000±n/a nM
Citation
 D3R, DD Abbott Urokinase D3R 227:0 (2015) Target
Name:
Urokinase-type plasminogen activator [179-424,C299A,N323Q]
Synonyms:
PLAU Urokinase
Type:
Mol. Mass.:
27687.84
Organism:
Homo sapiens (Human)
Description:
P00749[179-424,C299A,N323Q]
Residue:
246
  
Inhibitor
Name:
BDBM92311
Synonyms:
uPa_34
Type:
Emp. Form.:
C18H25N3O
Mol. Mass.:
299.4106
SMILES:
CC(C)CN(CC(C)C)C(=O)c1ccc2ccc(N)nc2c1
: