Target
Heat shock protein HSP 90-beta
Ligand
BDBM225714
Substrate
Meas. Tech.
FRET Assay
IC50
44.4±n/a nM
Citation
 D3R, DD AbbVie-CSAR HSP90 D3R 408:0 (2016) Target
Name:
Heat shock protein HSP 90-beta
Synonyms:
HS90B_HUMAN HSP 90 HSP90B HSPCB Heat shock protein HSP 90 (Hsp90)
Type:
Molecular Chaperone
Mol. Mass.:
83229.45
Organism:
Homo sapiens (Human)
Description:
P08238
Residue:
724
  
Inhibitor
Name:
BDBM225714
Synonyms:
hsp90_7
Type:
Small Organic Molecule
Emp. Form.:
C14H8ClN3O3
Mol. Mass.:
301.685
SMILES:
Oc1cc(O)c(cc1Cl)-n1c2ccc(cc2[nH]c1=O)C#N
: