Target
Heat shock protein HSP 90-beta
Ligand
BDBM225715
Substrate
Meas. Tech.
FRET Assay
IC50
43.8±n/a nM
Citation
 D3R, DD AbbVie-CSAR HSP90 D3R 408:0 (2016) Target
Name:
Heat shock protein HSP 90-beta
Synonyms:
HS90B_HUMAN HSP 90 HSP90B HSPCB Heat shock protein HSP 90 (Hsp90)
Type:
Molecular Chaperone
Mol. Mass.:
83229.45
Organism:
Homo sapiens (Human)
Description:
P08238
Residue:
724
  
Inhibitor
Name:
BDBM225715
Synonyms:
hsp90_8
Type:
Small Organic Molecule
Emp. Form.:
C13H10ClN3O5S
Mol. Mass.:
355.754
SMILES:
NS(=O)(=O)c1ccc2n(-c3cc(Cl)c(O)cc3O)c(=O)[nH]c2c1
: