Target
Heat shock protein HSP 90-beta
Ligand
BDBM225738
Substrate
Meas. Tech.
FRET Assay
IC50
12.1±n/a nM
Citation
 D3R, DD AbbVie-CSAR HSP90 D3R 408:0 (2016) Target
Name:
Heat shock protein HSP 90-beta
Synonyms:
HS90B_HUMAN HSP 90 HSP90B HSPCB Heat shock protein HSP 90 (Hsp90)
Type:
Molecular Chaperone
Mol. Mass.:
83229.45
Organism:
Homo sapiens (Human)
Description:
P08238
Residue:
724
  
Inhibitor
Name:
BDBM225738
Synonyms:
hsp90_32
Type:
Small Organic Molecule
Emp. Form.:
C21H18ClN3O5S
Mol. Mass.:
459.903
SMILES:
Cc1ccc(cc1)S(=O)(=O)NCc1ccc2n(-c3cc(Cl)c(O)cc3O)c(=O)[nH]c2c1
: