Target
Heat shock protein HSP 90-beta
Ligand
BDBM225782
Substrate
Meas. Tech.
FRET Assay
IC50
96.1±n/a nM
Citation
 D3R, DD AbbVie-CSAR HSP90 D3R 408:0 (2016) Target
Name:
Heat shock protein HSP 90-beta
Synonyms:
HS90B_HUMAN HSP 90 HSP90B HSPCB Heat shock protein HSP 90 (Hsp90)
Type:
Molecular Chaperone
Mol. Mass.:
83229.45
Organism:
Homo sapiens (Human)
Description:
P08238
Residue:
724
  
Inhibitor
Name:
BDBM225782
Synonyms:
hsp90_73
Type:
Small Organic Molecule
Emp. Form.:
C11H9ClN4O2
Mol. Mass.:
264.668
SMILES:
Cc1cc(nc(N)n1)-c1ccc(cc1Cl)N(=O)=O
: