Target
Heat shock protein HSP 90-beta
Ligand
BDBM225794
Substrate
Meas. Tech.
FRET Assay
IC50
23.4±n/a nM
Citation
 D3R, DD AbbVie-CSAR HSP90 D3R 408:0 (2016) Target
Name:
Heat shock protein HSP 90-beta
Synonyms:
HS90B_HUMAN HSP 90 HSP90B HSPCB Heat shock protein HSP 90 (Hsp90)
Type:
Molecular Chaperone
Mol. Mass.:
83229.45
Organism:
Homo sapiens (Human)
Description:
P08238
Residue:
724
  
Inhibitor
Name:
BDBM225794
Synonyms:
hsp90_85
Type:
Small Organic Molecule
Emp. Form.:
C12H9Cl3N4O
Mol. Mass.:
331.585
SMILES:
CO\N=C\c1c(Cl)nc(N)nc1-c1ccc(Cl)cc1Cl
: