Target
Heat shock protein HSP 90-beta
Ligand
BDBM225797
Substrate
Meas. Tech.
FRET Assay
IC50
67.8±n/a nM
Citation
 D3R, DD AbbVie-CSAR HSP90 D3R 408:0 (2016) Target
Name:
Heat shock protein HSP 90-beta
Synonyms:
HS90B_HUMAN HSP 90 HSP90B HSPCB Heat shock protein HSP 90 (Hsp90)
Type:
Molecular Chaperone
Mol. Mass.:
83229.45
Organism:
Homo sapiens (Human)
Description:
P08238
Residue:
724
  
Inhibitor
Name:
BDBM225797
Synonyms:
hsp90_88
Type:
Small Organic Molecule
Emp. Form.:
C13H9Cl3N4O3
Mol. Mass.:
375.595
SMILES:
Nc1nc(Cl)c(\C=N\OCC(O)=O)c(n1)-c1ccc(Cl)cc1Cl
: