Target
Heat shock protein HSP 90-beta
Ligand
BDBM225840
Substrate
Meas. Tech.
FRET Assay
IC50
10±n/a nM
Citation
 D3R, DD AbbVie-CSAR HSP90 D3R 408:0 (2016) Target
Name:
Heat shock protein HSP 90-beta
Synonyms:
HS90B_HUMAN HSP 90 HSP90B HSPCB Heat shock protein HSP 90 (Hsp90)
Type:
Molecular Chaperone
Mol. Mass.:
83229.45
Organism:
Homo sapiens (Human)
Description:
P08238
Residue:
724
  
Inhibitor
Name:
BDBM225840
Synonyms:
hsp90_131
Type:
Small Organic Molecule
Emp. Form.:
C21H13N3O3
Mol. Mass.:
355.3462
SMILES:
Cc1ccccc1Nc1cc2C(=O)c3ccccc3C(=O)c2c2nonc12
: