Target
Mitogen-activated protein kinase kinase kinase kinase 4
Ligand
BDBM225892
Substrate
Meas. Tech.
Z'Lyte Assay
IC50
22.5±n/a nM
Citation
 D3R, DD Genentech MAP4K4 D3R 409:0 (2016) Target
Name:
Mitogen-activated protein kinase kinase kinase kinase 4
Synonyms:
HGK KIAA0687 MAP4K4 MAPK/ERK kinase kinase kinase 4 MEKKK 4 NIK | Nck-interacting kinase
Type:
Serine/threonine-protein kinase
Mol. Mass.:
142114.73
Organism:
Homo sapiens (Human)
Description:
O95819
Residue:
1239
  
Inhibitor
Name:
BDBM225892
Synonyms:
MAP11
Type:
Small Organic Molecule
Emp. Form.:
C18H12N6
Mol. Mass.:
312.3281
SMILES:
N#Cc1cccc(c1)-c1cc2c(Nc3ccncc3)ncnn2c1
: