Target
Mitogen-activated protein kinase kinase kinase kinase 4
Ligand
BDBM225896
Substrate
Meas. Tech.
Z'Lyte Assay
Ki
10.7±n/a nM
IC50
12.1±n/a nM
Citation
 D3R, DD Genentech MAP4K4 D3R 409:0 (2016) Target
Name:
Mitogen-activated protein kinase kinase kinase kinase 4
Synonyms:
HGK KIAA0687 MAP4K4 MAPK/ERK kinase kinase kinase 4 MEKKK 4 NIK | Nck-interacting kinase
Type:
Serine/threonine-protein kinase
Mol. Mass.:
142114.73
Organism:
Homo sapiens (Human)
Description:
O95819
Residue:
1239
  
Inhibitor
Name:
BDBM225896
Synonyms:
MAP15 US9855269, Compound 119
Type:
Small Organic Molecule
Emp. Form.:
C16H19N7
Mol. Mass.:
309.369
SMILES:
Cc1c[nH]nc1C1CCCN(C1)c1ccc2ncnc(N)c2n1
: