Target
Bile acid receptor
Ligand
BDBM225916
Substrate
Meas. Tech.
Scintillation Proximity Assay (SPA)
pH
7.4±n/a
IC50
7190±n/a nM
Comments
extracted
Citation
 D3R, DD Drug Design Data Resource Grand Challenge 2 Dataset: FXR - Farnesoid X Receptor D3R 882:0 (2017) Target
Name:
Bile acid receptor
Synonyms:
BAR FXR HRR1 NR1H4_HUMAN RIP14 Retinoid X receptor-interacting protein 14 | farnesoid x receptor
Type:
Nuclear Receptor
Mol. Mass.:
55916.24
Organism:
Homo sapiens (Human)
Description:
Q96RI1
Residue:
486
  
Inhibitor
Name:
BDBM225916
Synonyms:
FXR_4
Type:
Small Organic Molecule
Emp. Form.:
C23H28Cl2N2O2
Mol. Mass.:
435.387
SMILES:
Cc1onc(c1C(=O)N(C1CCCCC1)C1CCCCC1)-c1ccc(Cl)cc1Cl
: