Target
Bile acid receptor
Ligand
BDBM225926
Substrate
Meas. Tech.
Scintillation Proximity Assay (SPA)
pH
7.4±n/a
IC50
27100±n/a nM
Comments
extracted
Citation
 D3R, DD Drug Design Data Resource Grand Challenge 2 Dataset: FXR - Farnesoid X Receptor D3R 882:0 (2017) Target
Name:
Bile acid receptor
Synonyms:
BAR FXR HRR1 NR1H4_HUMAN RIP14 Retinoid X receptor-interacting protein 14 | farnesoid x receptor
Type:
Nuclear Receptor
Mol. Mass.:
55916.24
Organism:
Homo sapiens (Human)
Description:
Q96RI1
Residue:
486
  
Inhibitor
Name:
BDBM225926
Synonyms:
FXR_15
Type:
Small Organic Molecule
Emp. Form.:
C28H26FN3O3S
Mol. Mass.:
503.588
SMILES:
Fc1ccccc1S(=O)(=O)N1CCc2cc(C(=O)NCc3ccccc3)n(Cc3ccccc3)c2C1
: