Target
Bile acid receptor
Ligand
BDBM225932
Substrate
Meas. Tech.
Scintillation Proximity Assay (SPA)
pH
7.4±n/a
IC50
760±n/a nM
Comments
extracted
Citation
 D3R, DD Drug Design Data Resource Grand Challenge 2 Dataset: FXR - Farnesoid X Receptor D3R 882:0 (2017) Target
Name:
Bile acid receptor
Synonyms:
BAR FXR HRR1 NR1H4_HUMAN RIP14 Retinoid X receptor-interacting protein 14 | farnesoid x receptor
Type:
Nuclear Receptor
Mol. Mass.:
55916.24
Organism:
Homo sapiens (Human)
Description:
Q96RI1
Residue:
486
  
Inhibitor
Name:
BDBM225932
Synonyms:
FXR_21
Type:
Small Organic Molecule
Emp. Form.:
C27H24ClF2N3O
Mol. Mass.:
479.949
SMILES:
Fc1cc2nc(-c3ccc(Cl)cc3)n([C@@H](C3CCCCC3)C(=O)Nc3ccccc3)c2cc1F
: