Target
Bile acid receptor
Ligand
BDBM225956
Substrate
Meas. Tech.
Scintillation Proximity Assay (SPA)
pH
7.4±n/a
IC50
62400±n/a nM
Comments
extracted
Citation
 D3R, DD Drug Design Data Resource Grand Challenge 2 Dataset: FXR - Farnesoid X Receptor D3R 882:0 (2017) Target
Name:
Bile acid receptor
Synonyms:
BAR FXR HRR1 NR1H4_HUMAN RIP14 Retinoid X receptor-interacting protein 14 | farnesoid x receptor
Type:
Nuclear Receptor
Mol. Mass.:
55916.24
Organism:
Homo sapiens (Human)
Description:
Q96RI1
Residue:
486
  
Inhibitor
Name:
BDBM225956
Synonyms:
FXR_46
Type:
Small Organic Molecule
Emp. Form.:
C24H21N5O4S2
Mol. Mass.:
507.585
SMILES:
NC(=O)c1ccc(NC(=O)c2c3CN(CCc3nn2-c2ccccc2)S(=O)(=O)c2cccs2)cc1
: