Target
Bile acid receptor
Ligand
BDBM225984
Substrate
Meas. Tech.
Scintillation Proximity Assay (SPA)
pH
7.4±n/a
IC50
250±n/a nM
Comments
extracted
Citation
 D3R, DD Drug Design Data Resource Grand Challenge 2 Dataset: FXR - Farnesoid X Receptor D3R 882:0 (2017) Target
Name:
Bile acid receptor
Synonyms:
BAR FXR HRR1 NR1H4_HUMAN RIP14 Retinoid X receptor-interacting protein 14 | farnesoid x receptor
Type:
Nuclear Receptor
Mol. Mass.:
55916.24
Organism:
Homo sapiens (Human)
Description:
Q96RI1
Residue:
486
  
Inhibitor
Name:
BDBM225984
Synonyms:
FXR_77
Type:
Small Organic Molecule
Emp. Form.:
C26H21BrCl2N2O5S
Mol. Mass.:
624.33
SMILES:
OC(=O)c1ccc(CN2C(=O)C3(CCN(CC3)S(=O)(=O)c3cccc(Cl)c3Cl)c3cc(Br)ccc23)cc1
: