Target
Bile acid receptor
Ligand
BDBM225994
Substrate
Meas. Tech.
Scintillation Proximity Assay (SPA)
pH
7.4±n/a
IC50
853±n/a nM
Comments
extracted
Citation
 D3R, DD Drug Design Data Resource Grand Challenge 2 Dataset: FXR - Farnesoid X Receptor D3R 882:0 (2017) Target
Name:
Bile acid receptor
Synonyms:
BAR FXR HRR1 NR1H4_HUMAN RIP14 Retinoid X receptor-interacting protein 14 | farnesoid x receptor
Type:
Nuclear Receptor
Mol. Mass.:
55916.24
Organism:
Homo sapiens (Human)
Description:
Q96RI1
Residue:
486
  
Inhibitor
Name:
BDBM225994
Synonyms:
FXR_87
Type:
Small Organic Molecule
Emp. Form.:
C25H23BrN2O6S2
Mol. Mass.:
591.494
SMILES:
OC(=O)COc1ccc(CN2C(=O)C3(CCN(CC3)S(=O)(=O)c3cccs3)c3cc(Br)ccc23)cc1
: