Target
Bile acid receptor
Ligand
BDBM226000
Substrate
Meas. Tech.
Scintillation Proximity Assay (SPA)
pH
7.4±n/a
IC50
46700±n/a nM
Comments
extracted
Citation
 D3R, DD Drug Design Data Resource Grand Challenge 2 Dataset: FXR - Farnesoid X Receptor D3R 882:0 (2017) Target
Name:
Bile acid receptor
Synonyms:
BAR FXR HRR1 NR1H4_HUMAN RIP14 Retinoid X receptor-interacting protein 14 | farnesoid x receptor
Type:
Nuclear Receptor
Mol. Mass.:
55916.24
Organism:
Homo sapiens (Human)
Description:
Q96RI1
Residue:
486
  
Inhibitor
Name:
BDBM226000
Synonyms:
FXR_93
Type:
Small Organic Molecule
Emp. Form.:
C24H21N3O3S2
Mol. Mass.:
463.572
SMILES:
O=C(Nc1ccccc1)n1c2CN(CCc2cc1-c1ccccc1)S(=O)(=O)c1cccs1
: