Target
Coagulation factor X
Ligand
BDBM226029
Substrate
Meas. Tech.
D3R245
IC50
132±n/a nM
Citation
 D3R, DD GSK FactorXA-1 D3R 245:0 (2015) Target
Name:
Coagulation factor X
Synonyms:
Activated coagulation factor X (FXa) Coagulation factor X precursor F10 Factor X heavy chain Factor Xa Stuart-Prower factor
Type:
Enzyme
Mol. Mass.:
54726.60
Organism:
Homo sapiens (Human)
Description:
Residue:
488
  
Inhibitor
Name:
BDBM226029
Synonyms:
GTC000017A
Type:
Small Organic Molecule
Emp. Form.:
C21H26ClN3O7S
Mol. Mass.:
499.965
SMILES:
C[C@H](N1CC[C@H](N(CC(O)=O)S(=O)(=O)\C=C\c2ccc(Cl)cc2)C1=O)C(=O)N1CCOCC1
: