Target
Coagulation factor X
Ligand
BDBM226054
Substrate
Meas. Tech.
D3R245
IC50
24±n/a nM
Citation
 D3R, DD GSK FactorXA-1 D3R 245:0 (2015) Target
Name:
Coagulation factor X
Synonyms:
Activated coagulation factor X (FXa) Coagulation factor X precursor F10 Factor X heavy chain Factor Xa Stuart-Prower factor
Type:
Enzyme
Mol. Mass.:
54726.60
Organism:
Homo sapiens (Human)
Description:
Residue:
488
  
Inhibitor
Name:
BDBM226054
Synonyms:
GTC000042A
Type:
Small Organic Molecule
Emp. Form.:
C25H33ClN4O5S
Mol. Mass.:
537.071
SMILES:
C[C@H](N1CC[C@H](N(CCN(C)C)S(=O)(=O)c2ccc3cc(Cl)ccc3c2)C1=O)C(=O)N1CCOCC1
: