Target
Coagulation factor X
Ligand
BDBM12567
Substrate
Meas. Tech.
D3R246
IC50
4.36±n/a nM
Citation
 D3R, DD GSK FactorXA-2 D3R 246:0 (2015) Target
Name:
Coagulation factor X
Synonyms:
Activated coagulation factor X (FXa) Coagulation factor X precursor F10 Factor X heavy chain Factor Xa Stuart-Prower factor
Type:
Enzyme
Mol. Mass.:
54726.60
Organism:
Homo sapiens (Human)
Description:
Residue:
488
  
Inhibitor
Name:
BDBM12567
Synonyms:
2-[(6-chloronaphthalene-2-)[(3S)-1-[(2S)-1-(morpholin-4-yl)-1-oxopropan-2-yl]-2-oxopyrrolidin-3-yl]sulfonamido]acetic acid pyrrolidin-2-one-based inhibitor 26
Type:
Small organic molecule
Emp. Form.:
C23H26ClN3O7S
Mol. Mass.:
523.986
SMILES:
C[C@H](N1CC[C@H](N(CC(O)=O)S(=O)(=O)c2ccc3cc(Cl)ccc3c2)C1=O)C(=O)N1CCOCC1
: