Target
Coagulation factor X
Ligand
BDBM226063
Substrate
Meas. Tech.
D3R246
IC50
5939±n/a nM
Citation
 D3R, DD GSK FactorXA-2 D3R 246:0 (2015) Target
Name:
Coagulation factor X
Synonyms:
Activated coagulation factor X (FXa) Coagulation factor X precursor F10 Factor X heavy chain Factor Xa Stuart-Prower factor
Type:
Enzyme
Mol. Mass.:
54726.60
Organism:
Homo sapiens (Human)
Description:
Residue:
488
  
Inhibitor
Name:
BDBM226063
Synonyms:
GTC000050A
Type:
Small Organic Molecule
Emp. Form.:
C21H32ClN3O5S2
Mol. Mass.:
506.079
SMILES:
CC[C@H](C)[C@H](N1CC[C@H](N(C)S(=O)(=O)CCc2ccc(Cl)s2)C1=O)C(=O)N1CCOCC1
: