Target
Coagulation factor X
Ligand
BDBM226084
Substrate
Meas. Tech.
D3R246
IC50
562±n/a nM
Citation
 D3R, DD GSK FactorXA-2 D3R 246:0 (2015) Target
Name:
Coagulation factor X
Synonyms:
Activated coagulation factor X (FXa) Coagulation factor X precursor F10 Factor X heavy chain Factor Xa Stuart-Prower factor
Type:
Enzyme
Mol. Mass.:
54726.60
Organism:
Homo sapiens (Human)
Description:
Residue:
488
  
Inhibitor
Name:
BDBM226084
Synonyms:
GTC000071A
Type:
Small Organic Molecule
Emp. Form.:
C20H19ClFN3O6S2
Mol. Mass.:
515.963
SMILES:
CN(CC(O)=O)C(=O)c1ccc(N2CC[C@H](NS(=O)(=O)\C=C\c3ccc(Cl)s3)C2=O)c(F)c1
: