Target
Coagulation factor X
Ligand
BDBM226108
Substrate
Meas. Tech.
D3R246
IC50
10.78±n/a nM
Citation
 D3R, DD GSK FactorXA-2 D3R 246:0 (2015) Target
Name:
Coagulation factor X
Synonyms:
Activated coagulation factor X (FXa) Coagulation factor X precursor F10 Factor X heavy chain Factor Xa Stuart-Prower factor
Type:
Enzyme
Mol. Mass.:
54726.60
Organism:
Homo sapiens (Human)
Description:
Residue:
488
  
Inhibitor
Name:
BDBM226108
Synonyms:
GTC000095A
Type:
Small Organic Molecule
Emp. Form.:
C25H32ClFN4O4S2
Mol. Mass.:
571.127
SMILES:
CN(C)CCCN([C@H]1CCN(C1=O)c1ccc(cc1F)C(=O)N(C)C)S(=O)(=O)\C=C(/C)c1ccc(Cl)s1
: