Target
High affinity nerve growth factor receptor [441-796]
Ligand
BDBM226460
Substrate
Meas. Tech.
Cell Based Assay
Temperature
310.15±n/a K
IC50
4.72±n/a nM
Comments
extracted
Citation
 Bagal, SKCui, JJGreasley, SELunney, EAMcAlpine, IJNagata, ANinkovic, SOmoto, KSkerratt, SEStorer, RIWarmus, JS Tropomyosin-related kinase inhibitors US Patent  US9328096 Publication Date 5/3/2016 
Target
Name:
High affinity nerve growth factor receptor [441-796]
Synonyms:
MTC NTRK1_HUMAN TRKA Tyrosine kinase receptor A (TrkA)
Type:
Protein
Mol. Mass.:
39939.20
Organism:
Homo sapiens (Human)
Description:
Human his-tagged TrkA cytoplasmic domain (441-796 aa)
Residue:
356
  
Inhibitor
Name:
BDBM226460
Synonyms:
US9328096, 153
Type:
Small organic molecule
Emp. Form.:
C26H20Cl2FN5O4
Mol. Mass.:
556.373
SMILES:
O[C@@H]1COC[C@H]1NC(=O)c1cc(NC(=O)c2cc(c(Cl)cc2Cl)-c2ncccc2F)n(n1)-c1ccccc1
: