Target
High affinity nerve growth factor receptor [441-796]
Ligand
BDBM226485
Substrate
Meas. Tech.
Cell Based Assay
Temperature
310.15±n/a K
IC50
3.05±n/a nM
Comments
extracted
Citation
 Bagal, SKCui, JJGreasley, SELunney, EAMcAlpine, IJNagata, ANinkovic, SOmoto, KSkerratt, SEStorer, RIWarmus, JS Tropomyosin-related kinase inhibitors US Patent  US9328096 Publication Date 5/3/2016 
Target
Name:
High affinity nerve growth factor receptor [441-796]
Synonyms:
MTC NTRK1_HUMAN TRKA Tyrosine kinase receptor A (TrkA)
Type:
Protein
Mol. Mass.:
39939.20
Organism:
Homo sapiens (Human)
Description:
Human his-tagged TrkA cytoplasmic domain (441-796 aa)
Residue:
356
  
Inhibitor
Name:
BDBM226485
Synonyms:
US9328096, 178
Type:
Small organic molecule
Emp. Form.:
C26H19ClFN7O2
Mol. Mass.:
515.926
SMILES:
Fc1cc(Cl)c(cc1-c1ccccn1)C(=O)Nc1cc(nn1-c1ccccc1)C(=O)NCc1cn[nH]c1
: