Target
High affinity nerve growth factor receptor [441-796]
Ligand
BDBM226486
Substrate
Meas. Tech.
Cell Based Assay
Temperature
310.15±n/a K
IC50
1.74±n/a nM
Comments
extracted
Citation
 Bagal, SKCui, JJGreasley, SELunney, EAMcAlpine, IJNagata, ANinkovic, SOmoto, KSkerratt, SEStorer, RIWarmus, JS Tropomyosin-related kinase inhibitors US Patent  US9328096 Publication Date 5/3/2016 
Target
Name:
High affinity nerve growth factor receptor [441-796]
Synonyms:
MTC NTRK1_HUMAN TRKA Tyrosine kinase receptor A (TrkA)
Type:
Protein
Mol. Mass.:
39939.20
Organism:
Homo sapiens (Human)
Description:
Human his-tagged TrkA cytoplasmic domain (441-796 aa)
Residue:
356
  
Inhibitor
Name:
BDBM226486
Synonyms:
US9328096, 179
Type:
Small organic molecule
Emp. Form.:
C26H18Cl2FN7O2
Mol. Mass.:
550.371
SMILES:
Fc1cccnc1-c1cc(C(=O)Nc2cc(nn2-c2ccccc2)C(=O)NCc2cn[nH]c2)c(Cl)cc1Cl
: