Target
High affinity nerve growth factor receptor [441-796]
Ligand
BDBM226874
Substrate
Meas. Tech.
Cell Based Assay
Temperature
310.15±n/a K
IC50
3.22±n/a nM
Comments
extracted
Citation
 Bagal, SKCui, JJGreasley, SELunney, EAMcAlpine, IJNagata, ANinkovic, SOmoto, KSkerratt, SEStorer, RIWarmus, JS Tropomyosin-related kinase inhibitors US Patent  US9328096 Publication Date 5/3/2016 
Target
Name:
High affinity nerve growth factor receptor [441-796]
Synonyms:
MTC NTRK1_HUMAN TRKA Tyrosine kinase receptor A (TrkA)
Type:
Protein
Mol. Mass.:
39939.20
Organism:
Homo sapiens (Human)
Description:
Human his-tagged TrkA cytoplasmic domain (441-796 aa)
Residue:
356
  
Inhibitor
Name:
BDBM226874
Synonyms:
US9328096, 567
Type:
Small organic molecule
Emp. Form.:
C26H19Cl2FN8O2
Mol. Mass.:
565.386
SMILES:
Cn1cc(CNC(=O)c2cc(NC(=O)c3cc(c(Cl)cc3Cl)-c3ncccc3F)n(n2)-c2ccccc2)nn1
: