Target
High affinity nerve growth factor receptor [441-796]
Ligand
BDBM226999
Substrate
Meas. Tech.
Cell Based Assay
Temperature
310.15±n/a K
IC50
2.27±n/a nM
Comments
extracted
Citation
 Bagal, SKCui, JJGreasley, SELunney, EAMcAlpine, IJNagata, ANinkovic, SOmoto, KSkerratt, SEStorer, RIWarmus, JS Tropomyosin-related kinase inhibitors US Patent  US9328096 Publication Date 5/3/2016 
Target
Name:
High affinity nerve growth factor receptor [441-796]
Synonyms:
MTC NTRK1_HUMAN TRKA Tyrosine kinase receptor A (TrkA)
Type:
Protein
Mol. Mass.:
39939.20
Organism:
Homo sapiens (Human)
Description:
Human his-tagged TrkA cytoplasmic domain (441-796 aa)
Residue:
356
  
Inhibitor
Name:
BDBM226999
Synonyms:
US9328096, 687
Type:
Small organic molecule
Emp. Form.:
C28H20ClFN6O3
Mol. Mass.:
542.948
SMILES:
Oc1ccc(CNC(=O)c2cc(NC(=O)c3cc(c(F)cc3Cl)-c3ccccn3)n(n2)-c2ccccc2)nc1
: