Target
Bone morphogenetic protein receptor type-1A
Ligand
BDBM148353
Substrate
Meas. Tech.
ALK1-6 enzymatic assays
pH
7.5±n/a
IC50
138±n/a nM
Comments
extracted
Citation
 Alimardanov, ACuny, GDGrewal, GSLee, AMcKew, JCMohedas, AHShen, MXu, XYu, PB BMP inhibitors and methods of use thereof US Patent  US9682983 Publication Date 6/20/2017 
Target
Name:
Bone morphogenetic protein receptor type-1A
Synonyms:
ACVRLK3 Activin receptor-like kinase 3 (ALK-3) BMR1A_HUMAN
Type:
Enzyme
Mol. Mass.:
60204.46
Organism:
Homo sapiens (Human)
Description:
P36894
Residue:
532
  
Inhibitor
Name:
BDBM148353
Synonyms:
US10017516, Compound 24 | US9682983, 24
Type:
Small organic molecule
Emp. Form.:
C26H24N6O
Mol. Mass.:
436.5084
SMILES:
OCc1cccc2c(ccnc12)-c1cnn2cc(cnc12)-c1ccc(cc1)N1CCNCC1
: